Reaction Details
TargetReceptor-type tyrosine-protein kinase FLT3
LigandBDBM50381931
Substrate/Competitorn/a
Meas. Tech.ChEMBL_814803 (CHEMBL2026428)
IC50>900±n/a nM
Citation Plé, PAJung, FAshton, SHennequin, LLaine, RLambert-van der Brempt, CMorgentin, RPasquet, GTaylor, S Discovery of new quinoline ether inhibitors with high affinity and selectivity for PDGFR tyrosine kinases. Bioorg Med Chem Lett22:3050-5 (2012) 
 
Receptor-type tyrosine-protein kinase FLT3
Name:Receptor-type tyrosine-protein kinase FLT3
Type:Enzyme
Mol. Mass.:112888.62
Organism:Homo sapiens (Human)
Description:P36888
Residue:993
BDBM50381931
NameBDBM50381931
Synonyms:CHEMBL2023476
TypeSmall organic molecule
Emp. Form.C23H21N3O4S
Mol. Mass.435.496
SMILESCOc1ccc2c(Oc3ccc(CC(=O)Nc4ncc(C)s4)c(OC)c3)ccnc2c1