Reaction Details
TargetMacrophage colony-stimulating factor 1 receptor
LigandBDBM50381925
Substrate/Competitorn/a
Meas. Tech.ChEMBL_817759 (CHEMBL2027407)
IC50>1000±n/a nM
Citation Plé, PAJung, FAshton, SHennequin, LLaine, RLambert-van der Brempt, CMorgentin, RPasquet, GTaylor, S Discovery of new quinoline ether inhibitors with high affinity and selectivity for PDGFR tyrosine kinases. Bioorg Med Chem Lett22:3050-5 (2012) 
 
Macrophage colony-stimulating factor 1 receptor
Name:Macrophage colony-stimulating factor 1 receptor
Type:Protein
Mol. Mass.:107979.48
Organism:Homo sapiens (Human)
Description:P07333
Residue:972
BDBM50381925
NameBDBM50381925
Synonyms:CHEMBL2023481
TypeSmall organic molecule
Emp. Form.C23H20FN3O4
Mol. Mass.421.421
SMILESCOc1cc(Oc2ccnc3ccc(F)cc23)ccc1CC(=O)Nc1noc(C)c1C