Reaction Details
TargetVascular endothelial growth factor receptor 2
LigandBDBM50381943
Substrate/Competitorn/a
Meas. Tech.ChEMBL_817758 (CHEMBL2027406)
IC50>10000±n/a nM
Citation Plé, PAJung, FAshton, SHennequin, LLaine, RLambert-van der Brempt, CMorgentin, RPasquet, GTaylor, S Discovery of new quinoline ether inhibitors with high affinity and selectivity for PDGFR tyrosine kinases. Bioorg Med Chem Lett22:3050-5 (2012) 
 
Vascular endothelial growth factor receptor 2
Name:Vascular endothelial growth factor receptor 2
Type:Receptor Tyrosine Kinase
Mol. Mass.:151510.97
Organism:Homo sapiens (Human)
Description:P35968
Residue:1356
BDBM50381943
NameBDBM50381943
Synonyms:CHEMBL2023496
TypeSmall organic molecule
Emp. Form.C23H23N5O4
Mol. Mass.433.4598
SMILESCOc1ccc2c(Oc3cnc(CC(=O)Nc4cn(C)nc4C)c(OC)c3)ccnc2c1