Reaction Details
TargetPlatelet-derived growth factor receptor beta
LigandBDBM50381942
Substrate/Competitorn/a
Meas. Tech.ChEMBL_817757 (CHEMBL2027405)
IC50 5±n/a nM
Citation Plé, PAJung, FAshton, SHennequin, LLaine, RLambert-van der Brempt, CMorgentin, RPasquet, GTaylor, S Discovery of new quinoline ether inhibitors with high affinity and selectivity for PDGFR tyrosine kinases. Bioorg Med Chem Lett22:3050-5 (2012) 
 
Platelet-derived growth factor receptor beta
Name:Platelet-derived growth factor receptor beta
Type:Enzyme
Mol. Mass.:123922.25
Organism:Homo sapiens (Human)
Description:P09619
Residue:1106
BDBM50381942
NameBDBM50381942
Synonyms:CHEMBL2023493
TypeSmall organic molecule
Emp. Form.C24H24N4O4
Mol. Mass.432.4718
SMILESCOc1ccc2c(Oc3ccc(CC(=O)Nc4cc(C)nn4C)c(OC)c3)ccnc2c1