Reaction Details
TargetPlatelet-derived growth factor receptor beta
LigandBDBM50381935
Substrate/Competitorn/a
Meas. Tech.ChEMBL_817757 (CHEMBL2027405)
IC50 7±n/a nM
Citation Plé, PAJung, FAshton, SHennequin, LLaine, RLambert-van der Brempt, CMorgentin, RPasquet, GTaylor, S Discovery of new quinoline ether inhibitors with high affinity and selectivity for PDGFR tyrosine kinases. Bioorg Med Chem Lett22:3050-5 (2012) 
 
Platelet-derived growth factor receptor beta
Name:Platelet-derived growth factor receptor beta
Type:Enzyme
Mol. Mass.:123922.25
Organism:Homo sapiens (Human)
Description:P09619
Residue:1106
BDBM50381935
NameBDBM50381935
Synonyms:CHEMBL2023475
TypeSmall organic molecule
Emp. Form.C23H21FN4O3
Mol. Mass.420.4362
SMILESCCn1cc(NC(=O)Cc2ccc(Oc3ccnc4ccc(F)cc34)cc2OC)cn1