Reaction Details
TargetMacrophage colony-stimulating factor 1 receptor
LigandBDBM50381950
Substrate/Competitorn/a
Meas. Tech.ChEMBL_817759 (CHEMBL2027407)
IC50 9±n/a nM
Citation Plé, PAJung, FAshton, SHennequin, LLaine, RLambert-van der Brempt, CMorgentin, RPasquet, GTaylor, S Discovery of new quinoline ether inhibitors with high affinity and selectivity for PDGFR tyrosine kinases. Bioorg Med Chem Lett22:3050-5 (2012) 
 
Macrophage colony-stimulating factor 1 receptor
Name:Macrophage colony-stimulating factor 1 receptor
Type:Protein
Mol. Mass.:107979.48
Organism:Homo sapiens (Human)
Description:P07333
Residue:972
BDBM50381950
NameBDBM50381950
Synonyms:CHEMBL2023494
TypeSmall organic molecule
Emp. Form.C29H31N3O4
Mol. Mass.485.5741
SMILESCOc1ccc2c(Oc3ccc(CC(=O)Nc4cc(C)cc(CN(C)C)c4)c(OC)c3)ccnc2c1