Reaction Details
TargetVascular endothelial growth factor receptor 2
LigandBDBM50381938
Substrate/Competitorn/a
Meas. Tech.ChEMBL_817758 (CHEMBL2027406)
IC50 515±n/a nM
Citation Plé, PAJung, FAshton, SHennequin, LLaine, RLambert-van der Brempt, CMorgentin, RPasquet, GTaylor, S Discovery of new quinoline ether inhibitors with high affinity and selectivity for PDGFR tyrosine kinases. Bioorg Med Chem Lett22:3050-5 (2012) 
 
Vascular endothelial growth factor receptor 2
Name:Vascular endothelial growth factor receptor 2
Type:Receptor Tyrosine Kinase
Mol. Mass.:151510.97
Organism:Homo sapiens (Human)
Description:P35968
Residue:1356
BDBM50381938
NameBDBM50381938
Synonyms:CHEMBL2023483
TypeSmall organic molecule
Emp. Form.C24H24N4O4
Mol. Mass.432.4718
SMILESCOc1ccc2c(Oc3ccc(CC(=O)Nc4[nH]nc(C)c4C)c(OC)c3)ccnc2c1