Reaction Details
TargetCytochrome P450 3A4
LigandBDBM50381928
Substrate/Competitorn/a
Meas. Tech.ChEMBL_814825 (CHEMBL2026450)
IC50>8600±n/a nM
Citation Plé, PAJung, FAshton, SHennequin, LLaine, RLambert-van der Brempt, CMorgentin, RPasquet, GTaylor, S Discovery of new quinoline ether inhibitors with high affinity and selectivity for PDGFR tyrosine kinases. Bioorg Med Chem Lett22:3050-5 (2012) 
 
Cytochrome P450 3A4
Name:Cytochrome P450 3A4
Type:Enzyme
Mol. Mass.:57349.57
Organism:Homo sapiens (Human)
Description:n/a
Residue:503
BDBM50381928
NameBDBM50381928
Synonyms:CHEMBL2023802
TypeSmall organic molecule
Emp. Form.C26H29N5O5
Mol. Mass.491.539
SMILESCCOc1cc2nccc(Oc3cnc(CC(=O)Nc4[nH]nc(CC)c4C)c(OC)c3)c2cc1OC