Reaction Details
TargetAurora kinase B
LigandBDBM50382025
Substrate/Competitorn/a
Meas. Tech.ChEMBL_815110 (CHEMBL2024835)
IC50>3000±n/a nM
Citation Voss, MERainka, MPFleming, MPeterson, LHBelanger, DBSiddiqui, MAHruza, AVoigt, JGray, KBasso, AD Synthesis and SAR studies of imidazo-[1,2-a]-pyrazine Aurora kinase inhibitors with improved off-target kinase selectivity. Bioorg Med Chem Lett22:3544-9 (2012) 
 
Aurora kinase B
Name:Aurora kinase B
Type:Protein
Mol. Mass.:39327.72
Organism:Homo sapiens (Human)
Description:Q96GD4
Residue:344
BDBM50382025
NameBDBM50382025
Synonyms:CHEMBL2022117
TypeSmall organic molecule
Emp. Form.C23H29N9OS
Mol. Mass.479.601
SMILESCN(C)C(=O)Cn1cc(cn1)-c1cnc2c(Nc3cc(CN4CCCCC4)ns3)nc(C)cn12