Reaction Details
TargetAurora kinase B
LigandBDBM50381994
Substrate/Competitorn/a
Meas. Tech.ChEMBL_815111 (CHEMBL2024836)
EC50 416±n/a nM
Citation Voss, MERainka, MPFleming, MPeterson, LHBelanger, DBSiddiqui, MAHruza, AVoigt, JGray, KBasso, AD Synthesis and SAR studies of imidazo-[1,2-a]-pyrazine Aurora kinase inhibitors with improved off-target kinase selectivity. Bioorg Med Chem Lett22:3544-9 (2012) 
 
Aurora kinase B
Name:Aurora kinase B
Type:Protein
Mol. Mass.:39327.72
Organism:Homo sapiens (Human)
Description:Q96GD4
Residue:344
BDBM50381994
NameBDBM50381994
Synonyms:CHEMBL2023295
TypeSmall organic molecule
Emp. Form.C28H30FN9OS
Mol. Mass.559.661
SMILESCc1cn2c(cnc2c(Nc2cc(CN3CCCCC3)ns2)n1)-c1cnn(CC(=O)NCc2ccc(F)cc2)c1