Reaction Details
TargetAurora kinase B
LigandBDBM50382022
Substrate/Competitorn/a
Meas. Tech.ChEMBL_815110 (CHEMBL2024835)
IC50 261±n/a nM
Citation Voss, MERainka, MPFleming, MPeterson, LHBelanger, DBSiddiqui, MAHruza, AVoigt, JGray, KBasso, AD Synthesis and SAR studies of imidazo-[1,2-a]-pyrazine Aurora kinase inhibitors with improved off-target kinase selectivity. Bioorg Med Chem Lett22:3544-9 (2012) 
 
Aurora kinase B
Name:Aurora kinase B
Type:Protein
Mol. Mass.:39327.72
Organism:Homo sapiens (Human)
Description:Q96GD4
Residue:344
BDBM50382022
NameBDBM50382022
Synonyms:CHEMBL2022122
TypeSmall organic molecule
Emp. Form.C30H35N9OS
Mol. Mass.569.724
SMILESCC1CCCN(Cc2cc(Nc3nc(C)cn4c(cnc34)-c3cnn(CC(=O)N(C)Cc4ccccc4)c3)sn2)C1