Reaction Details
TargetSerine/threonine-protein kinase Chk1
LigandBDBM50381996
Substrate/Competitorn/a
Meas. Tech.ChEMBL_815114 (CHEMBL2024839)
IC50 20±n/a nM
Citation Voss, MERainka, MPFleming, MPeterson, LHBelanger, DBSiddiqui, MAHruza, AVoigt, JGray, KBasso, AD Synthesis and SAR studies of imidazo-[1,2-a]-pyrazine Aurora kinase inhibitors with improved off-target kinase selectivity. Bioorg Med Chem Lett22:3544-9 (2012) 
 
Serine/threonine-protein kinase Chk1
Name:Serine/threonine-protein kinase Chk1
Type:Enzyme Catalytic Domain
Mol. Mass.:54443.02
Organism:Homo sapiens (Human)
Description:gi_166295192
Residue:476
BDBM50381996
NameBDBM50381996
Synonyms:CHEMBL2022373
TypeSmall organic molecule
Emp. Form.C27H27F2N9OS
Mol. Mass.563.625
SMILESCc1cn2c(cnc2c(Nc2cc(CN3CCCCC3)ns2)n1)-c1cnn(CC(=O)Nc2cccc(F)c2F)c1