Reaction Details
TargetAurora kinase B
LigandBDBM50382003
Substrate/Competitorn/a
Meas. Tech.ChEMBL_815111 (CHEMBL2024836)
EC50 534±n/a nM
Citation Voss, MERainka, MPFleming, MPeterson, LHBelanger, DBSiddiqui, MAHruza, AVoigt, JGray, KBasso, AD Synthesis and SAR studies of imidazo-[1,2-a]-pyrazine Aurora kinase inhibitors with improved off-target kinase selectivity. Bioorg Med Chem Lett22:3544-9 (2012) 
 
Aurora kinase B
Name:Aurora kinase B
Type:Protein
Mol. Mass.:39327.72
Organism:Homo sapiens (Human)
Description:Q96GD4
Residue:344
BDBM50382003
NameBDBM50382003
Synonyms:CHEMBL2022123
TypeSmall organic molecule
Emp. Form.C28H30N10S
Mol. Mass.538.67
SMILESCC1CCCN(Cc2cc(Nc3nc(C)cn4c(cnc34)-c3cnn(Cc4nc5ccccc5[nH]4)c3)sn2)C1