Reaction Details
TargetAurora kinase B
LigandBDBM50382021
Substrate/Competitorn/a
Meas. Tech.ChEMBL_815111 (CHEMBL2024836)
EC50 110±n/a nM
Citation Voss, MERainka, MPFleming, MPeterson, LHBelanger, DBSiddiqui, MAHruza, AVoigt, JGray, KBasso, AD Synthesis and SAR studies of imidazo-[1,2-a]-pyrazine Aurora kinase inhibitors with improved off-target kinase selectivity. Bioorg Med Chem Lett22:3544-9 (2012) 
 
Aurora kinase B
Name:Aurora kinase B
Type:Protein
Mol. Mass.:39327.72
Organism:Homo sapiens (Human)
Description:Q96GD4
Residue:344
BDBM50382021
NameBDBM50382021
Synonyms:CHEMBL2022713
TypeSmall organic molecule
Emp. Form.C27H29FN10OS
Mol. Mass.560.649
SMILESCC1CCCN(Cc2cc(Nc3nc(C)cn4c(cnc34)-c3cnn(CC(=O)Nc4cccnc4F)c3)sn2)C1