Reaction Details
TargetAurora kinase A
LigandBDBM50382025
Substrate/Competitorn/a
Meas. Tech.ChEMBL_815109 (CHEMBL2024834)
IC50>3000±n/a nM
Citation Voss, MERainka, MPFleming, MPeterson, LHBelanger, DBSiddiqui, MAHruza, AVoigt, JGray, KBasso, AD Synthesis and SAR studies of imidazo-[1,2-a]-pyrazine Aurora kinase inhibitors with improved off-target kinase selectivity. Bioorg Med Chem Lett22:3544-9 (2012) 
 
Aurora kinase A
Name:Aurora kinase A
Type:Serine/threonine-protein kinase
Mol. Mass.:45830.98
Organism:Homo sapiens (Human)
Description:O14965
Residue:403
BDBM50382025
NameBDBM50382025
Synonyms:CHEMBL2022117
TypeSmall organic molecule
Emp. Form.C23H29N9OS
Mol. Mass.479.601
SMILESCN(C)C(=O)Cn1cc(cn1)-c1cnc2c(Nc3cc(CN4CCCCC4)ns3)nc(C)cn12