Reaction Details
TargetAurora kinase A
LigandBDBM50382000
Substrate/Competitorn/a
Meas. Tech.ChEMBL_815109 (CHEMBL2024834)
IC50 1803±n/a nM
Citation Voss, MERainka, MPFleming, MPeterson, LHBelanger, DBSiddiqui, MAHruza, AVoigt, JGray, KBasso, AD Synthesis and SAR studies of imidazo-[1,2-a]-pyrazine Aurora kinase inhibitors with improved off-target kinase selectivity. Bioorg Med Chem Lett22:3544-9 (2012) 
 
Aurora kinase A
Name:Aurora kinase A
Type:Serine/threonine-protein kinase
Mol. Mass.:45830.98
Organism:Homo sapiens (Human)
Description:O14965
Residue:403
BDBM50382000
NameBDBM50382000
Synonyms:CHEMBL2022116
TypeSmall organic molecule
Emp. Form.C26H35N9OS
Mol. Mass.521.681
SMILESCC(C)CCNC(=O)Cn1cc(cn1)-c1cnc2c(Nc3cc(CN4CCCCC4)ns3)nc(C)cn12