Reaction Details
TargetAurora kinase A
LigandBDBM50382011
Substrate/Competitorn/a
Meas. Tech.ChEMBL_815109 (CHEMBL2024834)
IC50 413±n/a nM
Citation Voss, MERainka, MPFleming, MPeterson, LHBelanger, DBSiddiqui, MAHruza, AVoigt, JGray, KBasso, AD Synthesis and SAR studies of imidazo-[1,2-a]-pyrazine Aurora kinase inhibitors with improved off-target kinase selectivity. Bioorg Med Chem Lett22:3544-9 (2012) 
 
Aurora kinase A
Name:Aurora kinase A
Type:Serine/threonine-protein kinase
Mol. Mass.:45830.98
Organism:Homo sapiens (Human)
Description:O14965
Residue:403
BDBM50382011
NameBDBM50382011
Synonyms:CHEMBL2023298
TypeSmall organic molecule
Emp. Form.C30H32F3N9OS
Mol. Mass.623.695
SMILESCC1CCCN(Cc2cc(Nc3nc(C)cn4c(cnc34)-c3cnn(CC(=O)NCc4cccc(c4)C(F)(F)F)c3)sn2)C1