Reaction Details
TargetCannabinoid receptor 1
LigandBDBM50382329
Substrate/Competitorn/a
Meas. Tech.ChEMBL_817375 (CHEMBL2027598)
Ki 4.6±n/a nM
Citation Pérez-Fernández, RFresno, NMacías-González, MElguero, JDecara, JGirón, RRodríguez-Álvarez, AMartín, MIRodríguez de Fonseca, FGoya, P Discovery of Potent Dual PPARa Agonists/CB1 Ligands. ACS Med Chem Lett2:793-797 (2011) 
 
Cannabinoid receptor 1
Name:Cannabinoid receptor 1
Type:G Protein-Coupled Receptor (GPCR)
Mol. Mass.:52868.96
Organism:Homo sapiens (Human)
Description:P21554
Residue:472
BDBM50382329
NameBDBM50382329
Synonyms:CHEMBL2022405
TypeSmall organic molecule
Emp. Form.C23H16Cl3N3O2
Mol. Mass.472.751
SMILESCc1c(nn(c1-c1ccc(Cl)cc1)-c1ccc(Cl)cc1Cl)C(=O)Nc1ccc(O)cc1