Reaction Details
TargetAurora kinase B
LigandBDBM50382425
Substrate/Competitorn/a
Meas. Tech.ChEMBL_815593 (CHEMBL2025259)
IC50 12±n/a nM
Citation Mollard, AWarner, SLCall, LTWade, MLBearss, JJVerma, ASharma, SVankayalapati, HBearss, DJ Design, Synthesis and Biological Evaluation of a Series of Novel Axl Kinase Inhibitors. ACS Med Chem Lett2:907-912 (2011) 
 
Aurora kinase B
Name:Aurora kinase B
Type:Protein
Mol. Mass.:39327.72
Organism:Homo sapiens (Human)
Description:Q96GD4
Residue:344
BDBM50382425
NameBDBM50382425
Synonyms:CHEMBL2022968
TypeSmall organic molecule
Emp. Form.C24H30ClN7O2S
Mol. Mass.516.059
SMILESCN(C)S(=O)(=O)c1ccccc1Nc1nc(Nc2ccc(CN3CCN(C)CC3)cc2)ncc1Cl