Reaction Details
TargetTyrosine-protein kinase receptor UFO
LigandBDBM50382433
Substrate/Competitorn/a
Meas. Tech.ChEMBL_815463 (CHEMBL2027231)
IC50 37±n/a nM
Citation Mollard, AWarner, SLCall, LTWade, MLBearss, JJVerma, ASharma, SVankayalapati, HBearss, DJ Design, Synthesis and Biological Evaluation of a Series of Novel Axl Kinase Inhibitors. ACS Med Chem Lett2:907-912 (2011) 
 
Tyrosine-protein kinase receptor UFO
Name:Tyrosine-protein kinase receptor UFO
Type:Enzyme
Mol. Mass.:98316.97
Organism:Homo sapiens (Human)
Description:P30530
Residue:894
BDBM50382433
NameBDBM50382433
Synonyms:CHEMBL2022977
TypeSmall organic molecule
Emp. Form.C26H31ClFN7O2S
Mol. Mass.560.086
SMILESCN1CCN(Cc2ccc(Nc3ncc(Cl)c(Nc4ccc(F)cc4S(=O)(=O)N4CCCC4)n3)cc2)CC1