Reaction Details
TargetTyrosine-protein kinase receptor UFO
LigandBDBM50382437
Substrate/Competitorn/a
Meas. Tech.ChEMBL_815463 (CHEMBL2027231)
IC50 82±n/a nM
Citation Mollard, AWarner, SLCall, LTWade, MLBearss, JJVerma, ASharma, SVankayalapati, HBearss, DJ Design, Synthesis and Biological Evaluation of a Series of Novel Axl Kinase Inhibitors. ACS Med Chem Lett2:907-912 (2011) 
 
Tyrosine-protein kinase receptor UFO
Name:Tyrosine-protein kinase receptor UFO
Type:Enzyme
Mol. Mass.:98316.97
Organism:Homo sapiens (Human)
Description:P30530
Residue:894
BDBM50382437
NameBDBM50382437
Synonyms:CHEMBL2023345
TypeSmall organic molecule
Emp. Form.C24H28ClFN6O2S
Mol. Mass.519.035
SMILESCN(C)S(=O)(=O)c1cc(F)ccc1-c1nc(Nc2ccc(CN3CCN(C)CC3)cc2)ncc1Cl