Reaction Details
TargetTyrosine-protein kinase receptor UFO
LigandBDBM50382439
Substrate/Competitorn/a
Meas. Tech.ChEMBL_815463 (CHEMBL2027231)
IC50 56±n/a nM
Citation Mollard, AWarner, SLCall, LTWade, MLBearss, JJVerma, ASharma, SVankayalapati, HBearss, DJ Design, Synthesis and Biological Evaluation of a Series of Novel Axl Kinase Inhibitors. ACS Med Chem Lett2:907-912 (2011) 
 
Tyrosine-protein kinase receptor UFO
Name:Tyrosine-protein kinase receptor UFO
Type:Enzyme
Mol. Mass.:98316.97
Organism:Homo sapiens (Human)
Description:P30530
Residue:894
BDBM50382439
NameBDBM50382439
Synonyms:CHEMBL2023347
TypeSmall organic molecule
Emp. Form.C25H32ClN7O2S
Mol. Mass.530.085
SMILESCN(C)S(=O)(=O)c1ccccc1Nc1nc(Nc2ccc(cc2)N(C)C2CCN(C)CC2)ncc1Cl