Reaction Details
TargetNeuronal acetylcholine receptor subunit alpha-4/beta-2
LigandBDBM50382474
Substrate/Competitorn/a
Meas. Tech.ChEMBL_815799 (CHEMBL2025966)
IC50 4.8±n/a nM
Citation Zhang, HTückmantel, WEaton, JBYuen, PWYu, LFBajjuri, KMFedolak, AWang, DGhavami, ACaldarone, BPaterson, NELowe, DABrunner, DLukas, RJKozikowski, AP Chemistry and behavioral studies identify chiral cyclopropanes as selectivea4ß2-nicotinic acetylcholine receptor partial agonists exhibiting an antidepressant profile. J Med Chem55:717-24 (2012) 
 
Neuronal acetylcholine receptor subunit alpha-4/beta-2
Name:Neuronal acetylcholine receptor subunit alpha-4/beta-2
Type:Protein
Mol. Mass.:n/a
Description:n/a
Components:This complex has 2 components.
Component 1
Name:Neuronal acetylcholine receptor subunit alpha-4
Synonyms:ACHA4_HUMAN CHRNA4 protein Neuronal acetylcholine receptor protein alpha-4 subunit Nicotinic acetylcholine receptor alpha4/beta2/alpha5
Type:n/a
Mol. Mass.:69963.49
Organism:Homo sapiens (Human)
Description:NACHRA4
Residue:627
Component 2
Name:Neuronal acetylcholine receptor subunit beta-2
Synonyms:ACHB2_HUMAN Neuronal acetylcholine receptor protein beta-2 subunit | Nicotinic acetylcholine receptor alpha3/beta2/alpha5
Type:Protein
Mol. Mass.:57020.50
Organism:Homo sapiens (Human)
Description:P17787
Residue:502
BDBM50382474
NameBDBM50382474
Synonyms:CHEMBL2024096 | US9303017, Sazetidine-A
TypeSmall organic molecule
Emp. Form.C15H20N2O2
Mol. Mass.260.3315
SMILESOCCCCC#Cc1cncc(OC[C@@H]2CCN2)c1