Reaction Details
TargetcGMP-specific 3',5'-cyclic phosphodiesterase
LigandBDBM50126458
Substrate/Competitorn/a
Meas. Tech.ChEMBL_816147 (CHEMBL2024713)
IC50 5±n/a nM
Citation Beghyn, TBCharton, JLeroux, FHenninot, AReboule, ICos, PMaes, LDeprez, B Drug-to-genome-to-drug, step 2: reversing selectivity in a series of antiplasmodial compounds. J Med Chem55:1274-86 (2012) 
 
cGMP-specific 3',5'-cyclic phosphodiesterase
Name:cGMP-specific 3',5'-cyclic phosphodiesterase
Type:PROTEIN
Mol. Mass.:98615.45
Organism:Bos taurus
Description:ChEMBL_155186
Residue:865
BDBM50126458
NameBDBM50126458
Synonyms:(6R,12aR)-6-Benzo[1,3]dioxol-5-yl-2-((R)-1-benzyl-pyrrolidin-3-yl)-2,3,6,7,12,12a-hexahydro-pyrazino[1',2':1,6]pyrido[3,4-b]indole-1,4-dione | CHEMBL32255
TypeSmall organic molecule
Emp. Form.C32H30N4O4
Mol. Mass.534.605
SMILESO=C1CN([C@@H]2CCN(Cc3ccccc3)C2)C(=O)[C@H]2Cc3c([nH]c4ccccc34)[C@H](N12)c1ccc2OCOc2c1