Reaction Details
TargetPotassium voltage-gated channel subfamily H member 2
LigandBDBM50382546
Substrate/Competitorn/a
Meas. Tech.ChEMBL_816515 (CHEMBL2025095)
IC50>25000±n/a nM
Citation Wang, FGood, JARath, OKaan, HYSutcliffe, OBMackay, SPKozielski, F Triphenylbutanamines: kinesin spindle protein inhibitors with in vivo antitumor activity. J Med Chem55:1511-25 (2012) 
 
Potassium voltage-gated channel subfamily H member 2
Name:Potassium voltage-gated channel subfamily H member 2
Type:Multi-pass membrane protein
Mol. Mass.:126672.65
Organism:Homo sapiens (Human)
Description:Q12809
Residue:1159
BDBM50382546
NameBDBM50382546
Synonyms:CHEMBL2022996
TypeSmall organic molecule
Emp. Form.C24H25NO2
Mol. Mass.359.4608
SMILESCc1cccc(c1)C(CC[C@@H](N)C(O)=O)(c1ccccc1)c1ccccc1