Reaction Details
TargetCytochrome P450 1A2
LigandBDBM50382559
Substrate/Competitorn/a
Meas. Tech.ChEMBL_816517 (CHEMBL2025097)
IC50>25000±n/a nM
Citation Wang, FGood, JARath, OKaan, HYSutcliffe, OBMackay, SPKozielski, F Triphenylbutanamines: kinesin spindle protein inhibitors with in vivo antitumor activity. J Med Chem55:1511-25 (2012) 
 
Cytochrome P450 1A2
Name:Cytochrome P450 1A2
Type:Enzyme
Mol. Mass.:58423.38
Organism:Homo sapiens (Human)
Description:P05177
Residue:516
BDBM50382559
NameBDBM50382559
Synonyms:ISPINESIB
TypeSmall organic molecule
Emp. Form.C30H33ClN4O2
Mol. Mass.517.062
SMILESCC(C)[C@@H](N(CCCN)C(=O)c1ccc(C)cc1)c1nc2cc(Cl)ccc2c(=O)n1Cc1ccccc1