Reaction Details
TargetCytochrome P450 2D6
LigandBDBM50382548
Substrate/Competitorn/a
Meas. Tech.ChEMBL_816520 (CHEMBL2025100)
IC50>25000±n/a nM
Citation Wang, FGood, JARath, OKaan, HYSutcliffe, OBMackay, SPKozielski, F Triphenylbutanamines: kinesin spindle protein inhibitors with in vivo antitumor activity. J Med Chem55:1511-25 (2012) 
 
Cytochrome P450 2D6
Name:Cytochrome P450 2D6
Type:Protein
Mol. Mass.:55774.82
Organism:Homo sapiens (Human)
Description:P10635
Residue:497
BDBM50382548
NameBDBM50382548
Synonyms:CHEMBL2022995
TypeSmall organic molecule
Emp. Form.C24H25NO2
Mol. Mass.359.4608
SMILESCc1cccc(c1)C(CC[C@H](N)C(O)=O)(c1ccccc1)c1ccccc1