Reaction Details
TargetKinesin-like protein KIF11
LigandBDBM50382547
Substrate/Competitorn/a
Meas. Tech.ChEMBL_816346 (CHEMBL2024744)
Ki 203±n/a nM
Citation Wang, FGood, JARath, OKaan, HYSutcliffe, OBMackay, SPKozielski, F Triphenylbutanamines: kinesin spindle protein inhibitors with in vivo antitumor activity. J Med Chem55:1511-25 (2012) 
 
Kinesin-like protein KIF11
Name:Kinesin-like protein KIF11
Type:PROTEIN
Mol. Mass.:119138.97
Organism:Homo sapiens (Human)
Description:ChEMBL_1457426
Residue:1056
BDBM50382547
NameBDBM50382547
Synonyms:CHEMBL2022591
TypeSmall organic molecule
Emp. Form.C22H23N
Mol. Mass.301.4247
SMILESNCCCC(c1ccccc1)(c1ccccc1)c1ccccc1