Reaction Details
TargetKinesin-like protein KIF11
LigandBDBM50382581
Substrate/Competitorn/a
Meas. Tech.ChEMBL_816346 (CHEMBL2024744)
Ki 10.7±n/a nM
Citation Wang, FGood, JARath, OKaan, HYSutcliffe, OBMackay, SPKozielski, F Triphenylbutanamines: kinesin spindle protein inhibitors with in vivo antitumor activity. J Med Chem55:1511-25 (2012) 
 
Kinesin-like protein KIF11
Name:Kinesin-like protein KIF11
Type:PROTEIN
Mol. Mass.:119138.97
Organism:Homo sapiens (Human)
Description:ChEMBL_1457426
Residue:1056
BDBM50382581
NameBDBM50382581
Synonyms:CHEMBL2022998
TypeSmall organic molecule
Emp. Form.C22H22ClN
Mol. Mass.335.87
SMILESNCCCC(c1ccccc1)(c1ccccc1)c1ccc(Cl)cc1