Reaction Details
TargetKinesin-like protein KIF11
LigandBDBM50382586
Substrate/Competitorn/a
Meas. Tech.ChEMBL_816345 (CHEMBL2024743)
Ki 297.8±n/a nM
Citation Wang, FGood, JARath, OKaan, HYSutcliffe, OBMackay, SPKozielski, F Triphenylbutanamines: kinesin spindle protein inhibitors with in vivo antitumor activity. J Med Chem55:1511-25 (2012) 
 
Kinesin-like protein KIF11
Name:Kinesin-like protein KIF11
Type:PROTEIN
Mol. Mass.:119138.97
Organism:Homo sapiens (Human)
Description:ChEMBL_1457426
Residue:1056
BDBM50382586
NameBDBM50382586
Synonyms:CHEMBL2022979
TypeSmall organic molecule
Emp. Form.C21H20ClNS
Mol. Mass.353.908
SMILESNCCSC(c1ccccc1)(c1ccccc1)c1cccc(Cl)c1