Reaction Details
TargetKinesin-like protein KIF11
LigandBDBM50382584
Substrate/Competitorn/a
Meas. Tech.ChEMBL_816345 (CHEMBL2024743)
Ki 5.4±n/a nM
Citation Wang, FGood, JARath, OKaan, HYSutcliffe, OBMackay, SPKozielski, F Triphenylbutanamines: kinesin spindle protein inhibitors with in vivo antitumor activity. J Med Chem55:1511-25 (2012) 
 
Kinesin-like protein KIF11
Name:Kinesin-like protein KIF11
Type:PROTEIN
Mol. Mass.:119138.97
Organism:Homo sapiens (Human)
Description:ChEMBL_1457426
Residue:1056
BDBM50382584
NameBDBM50382584
Synonyms:CHEMBL2023001
TypeSmall organic molecule
Emp. Form.C24H25NO2
Mol. Mass.359.4608
SMILESCc1ccc(cc1)C(CC[C@@H](N)C(O)=O)(c1ccccc1)c1ccccc1