Reaction Details
TargetHistone deacetylase 1
LigandBDBM50382631
Substrate/Competitorn/a
Meas. Tech.ChEMBL_816565 (CHEMBL2025279)
IC50 11±n/a nM
Citation Guerrant, WPatil, VCanzoneri, JCOyelere, AK Dual targeting of histone deacetylase and topoisomerase II with novel bifunctional inhibitors. J Med Chem55:1465-77 (2012) 
 
Histone deacetylase 1
Name:Histone deacetylase 1
Type:Enzyme
Mol. Mass.:55090.27
Organism:Homo sapiens (Human)
Description:Q13547
Residue:482
BDBM50382631
NameBDBM50382631
Synonyms:CHEMBL2023530
TypeSmall organic molecule
Emp. Form.C44H51N5O12
Mol. Mass.841.902
SMILESCOc1cccc2C(=O)c3c(O)c4C[C@](O)(C[C@H](O[C@H]5C[C@H](NCc6ccc(cc6)-c6cn(CCCCCCCC(=O)NO)nn6)[C@H](O)[C@H](C)O5)c4c(O)c3C(=O)c12)C(C)=O