Reaction Details
TargetCarbonic anhydrase 1
LigandBDBM50382714
Substrate/Competitorn/a
Meas. Tech.ChEMBL_817309 (CHEMBL2025934)
Ki 0.97±n/a nM
Citation Carta, FAggarwal, MMaresca, AScozzafava, AMcKenna, RMasini, ESupuran, CT Dithiocarbamates strongly inhibit carbonic anhydrases and show antiglaucoma action in vivo. J Med Chem55:1721-30 (2012) 
 
Carbonic anhydrase 1
Name:Carbonic anhydrase 1
Type:Enzyme
Mol. Mass.:28873.37
Organism:Homo sapiens (Human)
Description:P00915
Residue:261
BDBM50382714
NameBDBM50382714
Synonyms:CHEMBL2023719
TypeSmall organic molecule
Emp. Form.C9H18NS2
Mol. Mass.204.376
SMILESCC(C)CN(CC(C)C)C([S-])=S