Reaction Details
TargetCarbonic anhydrase 1
LigandBDBM50382717
Substrate/Competitorn/a
Meas. Tech.ChEMBL_817309 (CHEMBL2025934)
Ki 48±n/a nM
Citation Carta, FAggarwal, MMaresca, AScozzafava, AMcKenna, RMasini, ESupuran, CT Dithiocarbamates strongly inhibit carbonic anhydrases and show antiglaucoma action in vivo. J Med Chem55:1721-30 (2012) 
 
Carbonic anhydrase 1
Name:Carbonic anhydrase 1
Type:Enzyme
Mol. Mass.:28873.37
Organism:Homo sapiens (Human)
Description:P00915
Residue:261
BDBM50382717
NameBDBM50382717
Synonyms:CHEMBL2023722
TypeSmall organic molecule
Emp. Form.C13H26NS2
Mol. Mass.260.483
SMILESCCCCCCN(CCCCCC)C([S-])=S