Reaction Details
TargetCarbonic anhydrase 1
LigandBDBM50382724
Substrate/Competitorn/a
Meas. Tech.ChEMBL_817309 (CHEMBL2025934)
Ki 2.5±n/a nM
Citation Carta, FAggarwal, MMaresca, AScozzafava, AMcKenna, RMasini, ESupuran, CT Dithiocarbamates strongly inhibit carbonic anhydrases and show antiglaucoma action in vivo. J Med Chem55:1721-30 (2012) 
 
Carbonic anhydrase 1
Name:Carbonic anhydrase 1
Type:Enzyme
Mol. Mass.:28873.37
Organism:Homo sapiens (Human)
Description:P00915
Residue:261
BDBM50382724
NameBDBM50382724
Synonyms:CHEMBL2023730
TypeSmall organic molecule
Emp. Form.C6H7NO2S2
Mol. Mass.189.256
SMILES[O-]C(=O)[C@@H]1CCCN1C([S-])=S