Reaction Details
TargetCarbonic anhydrase 2
LigandBDBM50382713
Substrate/Competitorn/a
Meas. Tech.ChEMBL_817438 (CHEMBL2027661)
Ki 28±n/a nM
Citation Carta, FAggarwal, MMaresca, AScozzafava, AMcKenna, RMasini, ESupuran, CT Dithiocarbamates strongly inhibit carbonic anhydrases and show antiglaucoma action in vivo. J Med Chem55:1721-30 (2012) 
 
Carbonic anhydrase 2
Name:Carbonic anhydrase 2
Type:Enzyme
Mol. Mass.:29250.71
Organism:Homo sapiens (Human)
Description:P00918
Residue:260
BDBM50382713
NameBDBM50382713
Synonyms:CHEMBL2021946
TypeSmall organic molecule
Emp. Form.C5H8NS2
Mol. Mass.146.254
SMILES[S-]C(=S)N1CCCC1