Reaction Details
TargetCarbonic anhydrase 2
LigandBDBM50382714
Substrate/Competitorn/a
Meas. Tech.ChEMBL_817438 (CHEMBL2027661)
Ki 0.95±n/a nM
Citation Carta, FAggarwal, MMaresca, AScozzafava, AMcKenna, RMasini, ESupuran, CT Dithiocarbamates strongly inhibit carbonic anhydrases and show antiglaucoma action in vivo. J Med Chem55:1721-30 (2012) 
 
Carbonic anhydrase 2
Name:Carbonic anhydrase 2
Type:Enzyme
Mol. Mass.:29250.71
Organism:Homo sapiens (Human)
Description:P00918
Residue:260
BDBM50382714
NameBDBM50382714
Synonyms:CHEMBL2023719
TypeSmall organic molecule
Emp. Form.C9H18NS2
Mol. Mass.204.376
SMILESCC(C)CN(CC(C)C)C([S-])=S