Reaction Details
TargetCarbonic anhydrase 12
LigandBDBM50382711
Substrate/Competitorn/a
Meas. Tech.ChEMBL_817440 (CHEMBL2027663)
Ki 6.5±n/a nM
Citation Carta, FAggarwal, MMaresca, AScozzafava, AMcKenna, RMasini, ESupuran, CT Dithiocarbamates strongly inhibit carbonic anhydrases and show antiglaucoma action in vivo. J Med Chem55:1721-30 (2012) 
 
Carbonic anhydrase 12
Name:Carbonic anhydrase 12
Type:Enzyme
Mol. Mass.:39456.00
Organism:Homo sapiens (Human)
Description:Catalytic domain of human cloned isozyme was used in the assay
Residue:354
BDBM50382711
NameBDBM50382711
Synonyms:CHEMBL2023718 | CHEMBL2334361
TypeSmall organic molecule
Emp. Form.C7H10N3S2
Mol. Mass.200.305
SMILES[S-]C(=S)NCCCn1ccnc1