Reaction Details
TargetCarbonic anhydrase 1
LigandBDBM50382726
Substrate/Competitorn/a
Meas. Tech.ChEMBL_817309 (CHEMBL2025934)
Ki 4.8±n/a nM
Citation Carta, FAggarwal, MMaresca, AScozzafava, AMcKenna, RMasini, ESupuran, CT Dithiocarbamates strongly inhibit carbonic anhydrases and show antiglaucoma action in vivo. J Med Chem55:1721-30 (2012) 
 
Carbonic anhydrase 1
Name:Carbonic anhydrase 1
Type:Enzyme
Mol. Mass.:28873.37
Organism:Homo sapiens (Human)
Description:P00915
Residue:261
BDBM50382726
NameBDBM50382726
Synonyms:CHEMBL2023163
TypeSmall organic molecule
Emp. Form.C5H9N2OS2
Mol. Mass.177.268
SMILES[S-]C(=S)NN1CCOCC1