Reaction Details
TargetCannabinoid receptor 1
LigandBDBM50382740
Substrate/Competitorn/a
Meas. Tech.ChEMBL_815226 (CHEMBL2025417)
IC50 291±n/a nM
Citation Odan, MIshizuka, NHiramatsu, YInagaki, MHashizume, HFujii, YMitsumori, SMorioka, YSoga, MDeguchi, MYasui, KArimura, A Discovery of S-444823, a potent CB1/CB2 dual agonist as an antipruritic agent. Bioorg Med Chem Lett22:2898-901 (2012) 
 
Cannabinoid receptor 1
Name:Cannabinoid receptor 1
Type:G Protein-Coupled Receptor (GPCR)
Mol. Mass.:52868.96
Organism:Homo sapiens (Human)
Description:P21554
Residue:472
BDBM50382740
NameBDBM50382740
Synonyms:CHEMBL2023574
TypeSmall organic molecule
Emp. Form.C26H32N2O4
Mol. Mass.436.5433
SMILESOC(=O)c1ccc(NC(=O)c2cc3CCCCCCc3n(CC3CCCCC3)c2=O)cc1