Reaction Details
TargetCannabinoid receptor 1
LigandBDBM50382749
Substrate/Competitorn/a
Meas. Tech.ChEMBL_815225 (CHEMBL2025416)
Ki 548±n/a nM
Citation Odan, MIshizuka, NHiramatsu, YInagaki, MHashizume, HFujii, YMitsumori, SMorioka, YSoga, MDeguchi, MYasui, KArimura, A Discovery of S-444823, a potent CB1/CB2 dual agonist as an antipruritic agent. Bioorg Med Chem Lett22:2898-901 (2012) 
 
Cannabinoid receptor 1
Name:Cannabinoid receptor 1
Type:G Protein-Coupled Receptor (GPCR)
Mol. Mass.:52868.96
Organism:Homo sapiens (Human)
Description:P21554
Residue:472
BDBM50382749
NameBDBM50382749
Synonyms:CHEMBL2023575
TypeSmall organic molecule
Emp. Form.C27H34N2O4
Mol. Mass.450.5699
SMILESOC(=O)Cc1ccccc1NC(=O)c1cc2CCCCCCc2n(CC2CCCCC2)c1=O