Reaction Details
TargetCannabinoid receptor 1
LigandBDBM50382750
Substrate/Competitorn/a
Meas. Tech.ChEMBL_815225 (CHEMBL2025416)
Ki>5000±n/a nM
Citation Odan, MIshizuka, NHiramatsu, YInagaki, MHashizume, HFujii, YMitsumori, SMorioka, YSoga, MDeguchi, MYasui, KArimura, A Discovery of S-444823, a potent CB1/CB2 dual agonist as an antipruritic agent. Bioorg Med Chem Lett22:2898-901 (2012) 
 
Cannabinoid receptor 1
Name:Cannabinoid receptor 1
Type:G Protein-Coupled Receptor (GPCR)
Mol. Mass.:52868.96
Organism:Homo sapiens (Human)
Description:P21554
Residue:472
BDBM50382750
NameBDBM50382750
Synonyms:CHEMBL2023579
TypeSmall organic molecule
Emp. Form.C23H29N3O4S
Mol. Mass.443.559
SMILESOC(=O)c1csc(NC(=O)c2cc3CCCCCCc3n(CC3CCCCC3)c2=O)n1