Reaction Details
TargetCannabinoid receptor 2
LigandBDBM50382741
Substrate/Competitorn/a
Meas. Tech.ChEMBL_815227 (CHEMBL2025418)
Ki 120±n/a nM
Citation Odan, MIshizuka, NHiramatsu, YInagaki, MHashizume, HFujii, YMitsumori, SMorioka, YSoga, MDeguchi, MYasui, KArimura, A Discovery of S-444823, a potent CB1/CB2 dual agonist as an antipruritic agent. Bioorg Med Chem Lett22:2898-901 (2012) 
 
Cannabinoid receptor 2
Name:Cannabinoid receptor 2
Type:G Protein-Coupled Receptor (GPCR)
Mol. Mass.:39690.94
Organism:Homo sapiens (Human)
Description:P34972
Residue:360
BDBM50382741
NameBDBM50382741
Synonyms:CHEMBL2023576
TypeSmall organic molecule
Emp. Form.C27H34N2O4
Mol. Mass.450.5699
SMILESOC(=O)Cc1cccc(NC(=O)c2cc3CCCCCCc3n(CC3CCCCC3)c2=O)c1