Reaction Details
TargetCannabinoid receptor 2
LigandBDBM50382753
Substrate/Competitorn/a
Meas. Tech.ChEMBL_815228 (CHEMBL2025419)
IC50 167±n/a nM
Citation Odan, MIshizuka, NHiramatsu, YInagaki, MHashizume, HFujii, YMitsumori, SMorioka, YSoga, MDeguchi, MYasui, KArimura, A Discovery of S-444823, a potent CB1/CB2 dual agonist as an antipruritic agent. Bioorg Med Chem Lett22:2898-901 (2012) 
 
Cannabinoid receptor 2
Name:Cannabinoid receptor 2
Type:G Protein-Coupled Receptor (GPCR)
Mol. Mass.:39690.94
Organism:Homo sapiens (Human)
Description:P34972
Residue:360
BDBM50382753
NameBDBM50382753
Synonyms:CHEMBL2023048
TypeSmall organic molecule
Emp. Form.C26H32N2O4
Mol. Mass.436.5433
SMILESOC(=O)c1ccccc1NC(=O)c1cc2CCCCCCc2n(CC2CCCCC2)c1=O