Reaction Details
TargetCalcitonin gene-related peptide type 1 receptor
LigandBDBM50382793
Substrate/Competitorn/a
Meas. Tech.ChEMBL_815265 (CHEMBL2025456)
IC50 0.093±n/a nM
Citation Luo, GChen, LCiviello, RPin, SSXu, CKostich, WKelley, MConway, CMMacor, JEDubowchik, GM Calcitonin gene-related peptide (CGRP) receptor antagonists: pyridine as a replacement for a core amide group. Bioorg Med Chem Lett22:2917-21 (2012) 
 
Calcitonin gene-related peptide type 1 receptor
Name:Calcitonin gene-related peptide type 1 receptor
Type:Enzyme Catalytic Domain
Mol. Mass.:52980.45
Organism:Homo sapiens (Human)
Description:Q16602
Residue:461
BDBM50382793
NameBDBM50382793
Synonyms:CHEMBL2023190
TypeSmall organic molecule
Emp. Form.C33H36ClN7O4
Mol. Mass.630.136
SMILESCN(C)C(=O)c1cc(Cl)nc(c1)C(Cc1cc(C)c2[nH]ncc2c1)OC(=O)N1CCC(CC1)N1CCc2ccccc2NC1=O