Reaction Details
TargetCalcitonin gene-related peptide type 1 receptor
LigandBDBM50382784
Substrate/Competitorn/a
Meas. Tech.ChEMBL_815266 (CHEMBL2025457)
IC50 0.042±n/a nM
Citation Luo, GChen, LCiviello, RPin, SSXu, CKostich, WKelley, MConway, CMMacor, JEDubowchik, GM Calcitonin gene-related peptide (CGRP) receptor antagonists: pyridine as a replacement for a core amide group. Bioorg Med Chem Lett22:2917-21 (2012) 
 
Calcitonin gene-related peptide type 1 receptor
Name:Calcitonin gene-related peptide type 1 receptor
Type:Enzyme Catalytic Domain
Mol. Mass.:52980.45
Organism:Homo sapiens (Human)
Description:Q16602
Residue:461
BDBM50382784
NameBDBM50382784
Synonyms:CHEMBL2022606
TypeSmall organic molecule
Emp. Form.C37H42N6O3
Mol. Mass.618.7678
SMILESCc1cc(CC(OC(=O)N2CCC(CC2)c2cc3ccccc3[nH]c2=O)c2cc(CN3CCCCCC3)ccn2)cc2cn[nH]c12