Reaction Details
TargetCalcitonin gene-related peptide type 1 receptor
LigandBDBM50382796
Substrate/Competitorn/a
Meas. Tech.ChEMBL_815265 (CHEMBL2025456)
IC50 0.21±n/a nM
Citation Luo, GChen, LCiviello, RPin, SSXu, CKostich, WKelley, MConway, CMMacor, JEDubowchik, GM Calcitonin gene-related peptide (CGRP) receptor antagonists: pyridine as a replacement for a core amide group. Bioorg Med Chem Lett22:2917-21 (2012) 
 
Calcitonin gene-related peptide type 1 receptor
Name:Calcitonin gene-related peptide type 1 receptor
Type:Enzyme Catalytic Domain
Mol. Mass.:52980.45
Organism:Homo sapiens (Human)
Description:Q16602
Residue:461
BDBM50382796
NameBDBM50382796
Synonyms:CHEMBL2024603
TypeSmall organic molecule
Emp. Form.C30H30N6O4
Mol. Mass.538.597
SMILESCc1cc(CC(OC(=O)N2CCC(CC2)N2Cc3ccccc3NC2=O)c2cc(C=O)ccn2)cc2cn[nH]c12