Reaction Details
TargetAmine oxidase [flavin-containing] B
LigandBDBM28681
Substrate/Competitorn/a
Meas. Tech.ChEMBL_819948 (CHEMBL2032535)
Ki 5800±n/a nM
Citation Binda, CAldeco, MGeldenhuys, WJTortorici, MMattevi, AEdmondson, DE Molecular Insights into Human Monoamine Oxidase B Inhibition by the Glitazone Anti-Diabetes Drugs. ACS Med Chem Lett3:39-42 (2012) 
 
Amine oxidase [flavin-containing] B
Name:Amine oxidase [flavin-containing] B
Type:Enzyme
Mol. Mass.:58469.65
Organism:Rattus norvegicus (rat)
Description:P19643
Residue:520
BDBM28681
NameBDBM28681
Synonyms:5-[(4-{2-[methyl(pyridin-2-yl)amino]ethoxy}phenyl)methyl]-1,3-thiazolidine-2,4-dione BRL 49653 CHEMBL121 [3H]rosiglitazone rosiglitazone
Typeradiolabeled ligand
Emp. Form.C18H19N3O3S
Mol. Mass.357.427
SMILESCN(CCOc1ccc(Cc2sc(=O)[nH]c2O)cc1)c1ccccn1