Reaction Details
TargetKinesin heavy chain isoform 5C
LigandBDBM50383087
Substrate/Competitorn/a
Meas. Tech.ChEMBL_818703 (CHEMBL2033192)
IC50 50000±n/a nM
Citation Nagarajan, SSkoufias, DAKozielski, FPae, AN Receptor-ligand interaction-based virtual screening for novel Eg5/kinesin spindle protein inhibitors. J Med Chem55:2561-73 (2012) 
 
Kinesin heavy chain isoform 5C
Name:Kinesin heavy chain isoform 5C
Type:PROTEIN
Mol. Mass.:109487.03
Organism:Homo sapiens (Human)
Description:ChEMBL_818703
Residue:957
BDBM50383087
NameBDBM50383087
Synonyms:CHEMBL2031572
TypeSmall organic molecule
Emp. Form.C20H15F2N5O2
Mol. Mass.395.3622
SMILESCc1ccc(cc1C)-n1c2nc(nc(C(N)=O)c2[nH]c1=O)-c1ccc(F)cc1F