Reaction Details
TargetVascular endothelial growth factor receptor 2
LigandBDBM50383170
Substrate/Competitorn/a
Meas. Tech.ChEMBL_819185 (CHEMBL2032454)
Ki 2720±n/a nM
Citation Liu, LNorman, MHLee, MXi, NSiegmund, ABoezio, AABooker, SChoquette, DD'Angelo, NDGermain, JYang, KYang, YZhang, YBellon, SFWhittington, DAHarmange, JCDominguez, CKim, TSDussault, I Structure-based design of novel class II c-Met inhibitors: 2. SAR and kinase selectivity profiles of the pyrazolone series. J Med Chem55:1868-97 (2012) 
 
Vascular endothelial growth factor receptor 2
Name:Vascular endothelial growth factor receptor 2
Type:Receptor Tyrosine Kinase
Mol. Mass.:151510.97
Organism:Homo sapiens (Human)
Description:P35968
Residue:1356
BDBM50383170
NameBDBM50383170
Synonyms:CHEMBL2032013
TypeSmall organic molecule
Emp. Form.C31H29N5O5
Mol. Mass.551.5925
SMILESCOc1ccc2c(Oc3ccc(NC(=O)c4c(C5CCOCC5)n(C)n(-c5ccccc5)c4=O)nc3)ccnc2c1